{"text_format":"1","workbook":"xlsx","n_sheets":6,"sheets":["Project Overview and Goals","Sample and Analysis Details","Sample Sheet","Information and Instructions","Upload-Sample Level","Data Validation"],"not_rendered":{"charts":0,"images":1,"macros":1,"external_links":0,"defined_names":5,"comments":0,"pivot_tables":0},"unopened":[],"bounds":{"document_bytes":16777216,"sheet_cells":100000,"rows_first":2000,"rows_last":500,"rows_between":2000,"halvings":0,"cell_chars":16384,"cell_head_chars":4096},"cells_cut":0,"cells_raw":0,"read":"whole","date_system":"1900"}

{"sheet":"Project Overview and Goals","index":0,"n_rows":49,"n_cols":4,"rows_kept":49,"cut":false,"hidden":false,"merged":[[45,3,45,11],[30,1,30,2],[25,1,25,2],[43,1,43,11],[44,1,44,11],[33,2,34,2]]}
[null,"Fields in light blue are required."]
[]
[null,"Customer Information:"]
[null,"Service Requestor's Information"]
[null,"Date of Request"]
[]
[null,"Customer Company/Institute Name:"]
[null,"Primary Customer Contact Name:"]
[null,"Customer Department:"]
[null,"Customer Title:"]
{"$rows_left_out":40}
{"sheet":"Sample and Analysis Details","index":1,"n_rows":36,"n_cols":3,"rows_kept":36,"cut":false,"hidden":false,"merged":[[32,2,33,2]]}
[]
[null,"Sample Information:"]
[null,"Sample Storage Conditions"]
[null,"What temperature were samples kept at before freezing?"]
[null,"How long were your samples kept at this temperature (prior to freezing)?"]
[null,"At what temperature were the frozen samples stored (-20/-80C)?"]
[null,"How long have the samples been kept frozen?"]
[null,"Have the samples ever been thawed and refrozen?"]
[null,"Did you count or weigh the samples before freezing?"]
[null,"      If so, what system did you use for counting cells?"]
{"$rows_left_out":27}
{"sheet":"Sample Sheet","index":2,"n_rows":116,"n_cols":19,"rows_kept":116,"cut":false,"hidden":false,"merged":[[3,12,10,15],[1,12,2,15],[18,13,18,14],[12,14,12,15],[1,6,1,7],[10,6,10,7],[12,6,12,7],[12,12,12,13],[14,12,14,13],[14,14,14,15],[14,6,14,7],[16,6,16,7],[2,6,2,8],[3,6,3,8],[16,12,16,13],[16,14,16,15],[6,1,6,2],[7,1,7,2],[8,1,8,2],[10,3,16,5],[1,3,2,5],[1,1,1,2],[2,1,2,2],[3,1,3,2],[5,1,5,2],[4,1,4,2],[4,6,4,8],[5,6,5,8],[6,6,6,8],[7,6,7,8],[8,6,8,8]]}
[]
[null," Ship From:",null,"Sample Sheet",null,null," Ship To:",null,"Bionano - San Diego",null,null,null,"Important Note"]
[null,null,null,null,null,null,{"$f":"IF($I$2=\"Bionano - San Diego\", \"Attn: Data Services Lab\", IF($I$2=\"Bionano - Clermont-Ferrand\", \"Attn: Michaela West\", \"\"))","v":"Attn: Data Services Lab"}]
[null,null,null,null,null,null,{"$f":"IF($I$2=\"Bionano - San Diego\", \"Bionano\", IF($I$2=\"Bionano - Clermont-Ferrand\", \"Site INRAE de Crouël\", \"\"))","v":"Bionano"},null,null,null,null,null,"Instructions\nPlease return this entire form to your Bionano Business/Sales Person for approval — you must receive approval before shipping your samples. \nInclude an additonal paper copy of the Sample Sheet with your shipped samples."]
[null,null,null,null,null,null,{"$f":"IF($I$2=\"Bionano - San Diego\", \"6777 Nancy Ridge Dr\", IF($I$2=\"Bionano - Clermont-Ferrand\", \"5 Chemin de Beaulieu\", \"\"))","v":"6777 Nancy Ridge Dr"}]
[null,null,null,null,null,null,{"$f":"IF($I$2=\"Bionano - San Diego\", \"San Diego, CA 92121\", IF($I$2=\"Bionano - Clermont-Ferrand\", \"63000 Clermont-Ferrand\", \"\"))","v":"San Diego, CA 92121"}]
[null,null,null,null,null,null,{"$f":"IF($I$2=\"Bionano - San Diego\", \"United States\", IF($I$2=\"Bionano - Clermont-Ferrand\", \"France\", \"\"))","v":"United States"}]
[null,null,null,null,null,null,{"$f":"IF($I$2=\"Bionano - San Diego\", \"Tel:  +1 (858) 888-7600\", IF($I$2=\"Bionano - Clermont-Ferrand\", \"+33 (0)6 73 20 67 66\", \"\"))","v":"Tel:  +1 (858) 888-7600"}]
[null,null,null,null,null,null,"dataservices@bionano.com"]
[]
{"$rows_left_out":107}
{"sheet":"Information and Instructions","index":3,"n_rows":46,"n_cols":4,"rows_kept":46,"cut":false,"hidden":false,"merged":[[39,1,41,1],[2,1,2,7],[3,1,3,7]]}
[]
[null,"Sample Information"]
[null,"Two or more aliquots per sample must be submitted so one can be used as a backup. Each aliquot should be prepared from a fresh sample with no prior freeze/thaw cycles. All frozen samples should be frozen as soon as possible, never thawed and shipped on dry ice. "]
[null,"Routine sample types will have a faster turnaround time. Expected turnaround times are based on batch sizes of 12 or fewer. Larger projects will have a rolling delivery, with the first batch of 12 samples completed within the time frame below. More details about sample types in appendix."]
[]
[null,"Sample Type††","Recommended Quantity Per Aliquot","Expected turnaround time"]
[null,"Frozen blood (EDTA)","650 uL","6 weeks"]
[null,"Frozen blood (Heparin)","† 650 uL (with Bionano DNA stabilizer added)","6 weeks"]
[null,"Live LCL culture","Healthy cells in T25 flask (1.5 million cells)","8-10 weeks"]
[null,"Frozen cells (cryopreserved)",">1,500,000 live cells/mL (in cryopreservative) ","8-10 weeks"]
{"$rows_left_out":37}
{"sheet":"Upload-Sample Level","index":4,"n_rows":97,"n_cols":25,"rows_kept":97,"cut":false,"hidden":true,"merged":[]}
["Sample Name","Sample Type","Quantity","Number of Aliquots","Organism","Reference Genome","Coverage Target","Application Desired","Sex","Variant Annotation","Sample Relationship","Dual Control \n(Sample ID or N/A)","Father/Sample 2 (Sample ID or N/A)","Mother/Sample 3 (Sample ID or N/A)","Objective or Pathology","Region of Interest","Additional Details","Date Shipped","Date Received","Lab","Sample/DNA Return","Bionano Data Use Consent","Salesforce Opportunity ID","Bionano Quote Number - label","Experiment Number(s)"]
[{"$f":"'Sample Sheet'!B21&\"\"","v":""},{"$f":"'Sample Sheet'!C21&\"\"","v":""},{"$f":"'Sample Sheet'!D21&\"\"","v":""},{"$f":"'Sample Sheet'!E21&\"\"","v":""},{"$f":"'Sample Sheet'!F21&\"\"","v":""},{"$f":"'Sample Sheet'!G21&\"\"","v":""},{"$f":"'Sample Sheet'!H21&\"\"","v":""},{"$f":"'Sample Sheet'!I21&\"\"","v":""},{"$f":"'Sample Sheet'!J21&\"\"","v":""},{"$f":"'Sample Sheet'!K21&\"\"","v":""},{"$f":"'Sample Sheet'!L21&\"\"","v":""},{"$f":"'Sample Sheet'!M21&\"\"","v":""},{"$f":"'Sample Sheet'!N21&\"\"","v":""},{"$f":"'Sample Sheet'!O21&\"\"","v":""},{"$f":"'Sample Sheet'!P21&\"\"","v":""},{"$f":"'Sample Sheet'!Q21&\"\"","v":""},{"$f":"'Sample Sheet'!R21&\"\"","v":""},{"$f":"IF(OR(COUNTBLANK(A2:Q2)=COLUMNS(A:Q),ISBLANK('Sample Sheet'!$I$13)),\"\",'Sample Sheet'!$I$13)","v":""},{"$f":"IF(OR(COUNTBLANK(A2:Q2)=COLUMNS(A:Q),'Sample Sheet'!$O$13=\"Bionano use only\"),\"\",'Sample Sheet'!$O$13)","v":""},{"$f":"IF(COUNTBLANK(A2:Q2)=COLUMNS(A:Q),\"\",'Sample Sheet'!$I$2)","v":""},{"$f":"IF(COUNTBLANK(A2:Q2)=COLUMNS(A:Q),\"\",'Sample Sheet'!$I$15)","v":""},{"$f":"IF(COUNTBLANK(A2:Q2)=COLUMNS(A:Q),\"\",IF('Sample Sheet'!$I$17='Data Validation'!$J$2,'Data Validation'!$J$4,IF('Sample Sheet'!$I$17='Data Validation'!$J$3,'Data Validation'!$J$5,\"\")))","v":""},{"$f":"IF(COUNTBLANK(A2:Q2)=COLUMNS(A:Q),\"\",IFERROR(REPLACE(LEFT('Sample Sheet'!$O$17,FIND(\";\",SUBSTITUTE('Sample Sheet'!$O$17,\"/\",\";\",7))-1),1,FIND(\" \",SUBSTITUTE(LEFT('Sample Sheet'!$O$17,FIND(\";\",SUBSTITUTE('Sample Sheet'!$O$17,\"/\",\";\",7))-1),\"/\",\" \",6)),\"\"),\"\"))","v":""},{"$f":"IF(OR(COUNTBLANK(A2:Q2)=COLUMNS(A:Q),'Sample Sheet'!$O$15=\"Bionano use only\"),\"\",'Sample Sheet'!$O$15)","v":""}]
[{"$f":"'Sample Sheet'!B22&\"\"","v":""},{"$f":"'Sample Sheet'!C22&\"\"","v":""},{"$f":"'Sample Sheet'!D22&\"\"","v":""},{"$f":"'Sample Sheet'!E22&\"\"","v":""},{"$f":"'Sample Sheet'!F22&\"\"","v":""},{"$f":"'Sample Sheet'!G22&\"\"","v":""},{"$f":"'Sample Sheet'!H22&\"\"","v":""},{"$f":"'Sample Sheet'!I22&\"\"","v":""},{"$f":"'Sample Sheet'!J22&\"\"","v":""},{"$f":"'Sample Sheet'!K22&\"\"","v":""},{"$f":"'Sample Sheet'!L22&\"\"","v":""},{"$f":"'Sample Sheet'!M22&\"\"","v":""},{"$f":"'Sample Sheet'!N22&\"\"","v":""},{"$f":"'Sample Sheet'!O22&\"\"","v":""},{"$f":"'Sample Sheet'!P22&\"\"","v":""},{"$f":"'Sample Sheet'!Q22&\"\"","v":""},{"$f":"'Sample Sheet'!R22&\"\"","v":""},{"$f":"IF(OR(COUNTBLANK(A3:Q3)=COLUMNS(A:Q),ISBLANK('Sample Sheet'!$I$13)),\"\",'Sample Sheet'!$I$13)","v":""},{"$f":"IF(OR(COUNTBLANK(A3:Q3)=COLUMNS(A:Q),'Sample Sheet'!$O$13=\"Bionano use only\"),\"\",'Sample Sheet'!$O$13)","v":""},{"$f":"IF(COUNTBLANK(A3:Q3)=COLUMNS(A:Q),\"\",'Sample Sheet'!$I$2)","v":""},{"$f":"IF(COUNTBLANK(A3:Q3)=COLUMNS(A:Q),\"\",'Sample Sheet'!$I$15)","v":""},{"$f":"IF(COUNTBLANK(A3:Q3)=COLUMNS(A:Q),\"\",IF('Sample Sheet'!$I$17='Data Validation'!$J$2,'Data Validation'!$J$4,IF('Sample Sheet'!$I$17='Data Validation'!$J$3,'Data Validation'!$J$5,\"\")))","v":""},{"$f":"IF(COUNTBLANK(A3:Q3)=COLUMNS(A:Q),\"\",IFERROR(REPLACE(LEFT('Sample Sheet'!$O$17,FIND(\";\",SUBSTITUTE('Sample Sheet'!$O$17,\"/\",\";\",7))-1),1,FIND(\" \",SUBSTITUTE(LEFT('Sample Sheet'!$O$17,FIND(\";\",SUBSTITUTE('Sample Sheet'!$O$17,\"/\",\";\",7))-1),\"/\",\" \",6)),\"\"),\"\"))","v":""},{"$f":"IF(OR(COUNTBLANK(A3:Q3)=COLUMNS(A:Q),'Sample Sheet'!$O$15=\"Bionano use only\"),\"\",'Sample Sheet'!$O$15)","v":""}]
[{"$f":"'Sample Sheet'!B23&\"\"","v":""},{"$f":"'Sample Sheet'!C23&\"\"","v":""},{"$f":"'Sample Sheet'!D23&\"\"","v":""},{"$f":"'Sample Sheet'!E23&\"\"","v":""},{"$f":"'Sample Sheet'!F23&\"\"","v":""},{"$f":"'Sample Sheet'!G23&\"\"","v":""},{"$f":"'Sample Sheet'!H23&\"\"","v":""},{"$f":"'Sample Sheet'!I23&\"\"","v":""},{"$f":"'Sample Sheet'!J23&\"\"","v":""},{"$f":"'Sample Sheet'!K23&\"\"","v":""},{"$f":"'Sample Sheet'!L23&\"\"","v":""},{"$f":"'Sample Sheet'!M23&\"\"","v":""},{"$f":"'Sample Sheet'!N23&\"\"","v":""},{"$f":"'Sample Sheet'!O23&\"\"","v":""},{"$f":"'Sample Sheet'!P23&\"\"","v":""},{"$f":"'Sample Sheet'!Q23&\"\"","v":""},{"$f":"'Sample Sheet'!R23&\"\"","v":""},{"$f":"IF(OR(COUNTBLANK(A4:Q4)=COLUMNS(A:Q),ISBLANK('Sample Sheet'!$I$13)),\"\",'Sample Sheet'!$I$13)","v":""},{"$f":"IF(OR(COUNTBLANK(A4:Q4)=COLUMNS(A:Q),'Sample Sheet'!$O$13=\"Bionano use only\"),\"\",'Sample Sheet'!$O$13)","v":""},{"$f":"IF(COUNTBLANK(A4:Q4)=COLUMNS(A:Q),\"\",'Sample Sheet'!$I$2)","v":""},{"$f":"IF(COUNTBLANK(A4:Q4)=COLUMNS(A:Q),\"\",'Sample Sheet'!$I$15)","v":""},{"$f":"IF(COUNTBLANK(A4:Q4)=COLUMNS(A:Q),\"\",IF('Sample Sheet'!$I$17='Data Validation'!$J$2,'Data Validation'!$J$4,IF('Sample Sheet'!$I$17='Data Validation'!$J$3,'Data Validation'!$J$5,\"\")))","v":""},{"$f":"IF(COUNTBLANK(A4:Q4)=COLUMNS(A:Q),\"\",IFERROR(REPLACE(LEFT('Sample Sheet'!$O$17,FIND(\";\",SUBSTITUTE('Sample Sheet'!$O$17,\"/\",\";\",7))-1),1,FIND(\" \",SUBSTITUTE(LEFT('Sample Sheet'!$O$17,FIND(\";\",SUBSTITUTE('Sample Sheet'!$O$17,\"/\",\";\",7))-1),\"/\",\" \",6)),\"\"),\"\"))","v":""},{"$f":"IF(OR(COUNTBLANK(A4:Q4)=COLUMNS(A:Q),'Sample Sheet'!$O$15=\"Bionano use only\"),\"\",'Sample Sheet'!$O$15)","v":""}]
[{"$f":"'Sample Sheet'!B24&\"\"","v":""},{"$f":"'Sample Sheet'!C24&\"\"","v":""},{"$f":"'Sample Sheet'!D24&\"\"","v":""},{"$f":"'Sample Sheet'!E24&\"\"","v":""},{"$f":"'Sample Sheet'!F24&\"\"","v":""},{"$f":"'Sample Sheet'!G24&\"\"","v":""},{"$f":"'Sample Sheet'!H24&\"\"","v":""},{"$f":"'Sample Sheet'!I24&\"\"","v":""},{"$f":"'Sample Sheet'!J24&\"\"","v":""},{"$f":"'Sample Sheet'!K24&\"\"","v":""},{"$f":"'Sample Sheet'!L24&\"\"","v":""},{"$f":"'Sample Sheet'!M24&\"\"","v":""},{"$f":"'Sample Sheet'!N24&\"\"","v":""},{"$f":"'Sample Sheet'!O24&\"\"","v":""},{"$f":"'Sample Sheet'!P24&\"\"","v":""},{"$f":"'Sample Sheet'!Q24&\"\"","v":""},{"$f":"'Sample Sheet'!R24&\"\"","v":""},{"$f":"IF(OR(COUNTBLANK(A5:Q5)=COLUMNS(A:Q),ISBLANK('Sample Sheet'!$I$13)),\"\",'Sample Sheet'!$I$13)","v":""},{"$f":"IF(OR(COUNTBLANK(A5:Q5)=COLUMNS(A:Q),'Sample Sheet'!$O$13=\"Bionano use only\"),\"\",'Sample Sheet'!$O$13)","v":""},{"$f":"IF(COUNTBLANK(A5:Q5)=COLUMNS(A:Q),\"\",'Sample Sheet'!$I$2)","v":""},{"$f":"IF(COUNTBLANK(A5:Q5)=COLUMNS(A:Q),\"\",'Sample Sheet'!$I$15)","v":""},{"$f":"IF(COUNTBLANK(A5:Q5)=COLUMNS(A:Q),\"\",IF('Sample Sheet'!$I$17='Data Validation'!$J$2,'Data Validation'!$J$4,IF('Sample Sheet'!$I$17='Data Validation'!$J$3,'Data Validation'!$J$5,\"\")))","v":""},{"$f":"IF(COUNTBLANK(A5:Q5)=COLUMNS(A:Q),\"\",IFERROR(REPLACE(LEFT('Sample Sheet'!$O$17,FIND(\";\",SUBSTITUTE('Sample Sheet'!$O$17,\"/\",\";\",7))-1),1,FIND(\" \",SUBSTITUTE(LEFT('Sample Sheet'!$O$17,FIND(\";\",SUBSTITUTE('Sample Sheet'!$O$17,\"/\",\";\",7))-1),\"/\",\" \",6)),\"\"),\"\"))","v":""},{"$f":"IF(OR(COUNTBLANK(A5:Q5)=COLUMNS(A:Q),'Sample Sheet'!$O$15=\"Bionano use only\"),\"\",'Sample Sheet'!$O$15)","v":""}]
[{"$f":"'Sample Sheet'!B25&\"\"","v":""},{"$f":"'Sample Sheet'!C25&\"\"","v":""},{"$f":"'Sample Sheet'!D25&\"\"","v":""},{"$f":"'Sample Sheet'!E25&\"\"","v":""},{"$f":"'Sample Sheet'!F25&\"\"","v":""},{"$f":"'Sample Sheet'!G25&\"\"","v":""},{"$f":"'Sample Sheet'!H25&\"\"","v":""},{"$f":"'Sample Sheet'!I25&\"\"","v":""},{"$f":"'Sample Sheet'!J25&\"\"","v":""},{"$f":"'Sample Sheet'!K25&\"\"","v":""},{"$f":"'Sample Sheet'!L25&\"\"","v":""},{"$f":"'Sample Sheet'!M25&\"\"","v":""},{"$f":"'Sample Sheet'!N25&\"\"","v":""},{"$f":"'Sample Sheet'!O25&\"\"","v":""},{"$f":"'Sample Sheet'!P25&\"\"","v":""},{"$f":"'Sample Sheet'!Q25&\"\"","v":""},{"$f":"'Sample Sheet'!R25&\"\"","v":""},{"$f":"IF(OR(COUNTBLANK(A6:Q6)=COLUMNS(A:Q),ISBLANK('Sample Sheet'!$I$13)),\"\",'Sample Sheet'!$I$13)","v":""},{"$f":"IF(OR(COUNTBLANK(A6:Q6)=COLUMNS(A:Q),'Sample Sheet'!$O$13=\"Bionano use only\"),\"\",'Sample Sheet'!$O$13)","v":""},{"$f":"IF(COUNTBLANK(A6:Q6)=COLUMNS(A:Q),\"\",'Sample Sheet'!$I$2)","v":""},{"$f":"IF(COUNTBLANK(A6:Q6)=COLUMNS(A:Q),\"\",'Sample Sheet'!$I$15)","v":""},{"$f":"IF(COUNTBLANK(A6:Q6)=COLUMNS(A:Q),\"\",IF('Sample Sheet'!$I$17='Data Validation'!$J$2,'Data Validation'!$J$4,IF('Sample Sheet'!$I$17='Data Validation'!$J$3,'Data Validation'!$J$5,\"\")))","v":""},{"$f":"IF(COUNTBLANK(A6:Q6)=COLUMNS(A:Q),\"\",IFERROR(REPLACE(LEFT('Sample Sheet'!$O$17,FIND(\";\",SUBSTITUTE('Sample Sheet'!$O$17,\"/\",\";\",7))-1),1,FIND(\" \",SUBSTITUTE(LEFT('Sample Sheet'!$O$17,FIND(\";\",SUBSTITUTE('Sample Sheet'!$O$17,\"/\",\";\",7))-1),\"/\",\" \",6)),\"\"),\"\"))","v":""},{"$f":"IF(OR(COUNTBLANK(A6:Q6)=COLUMNS(A:Q),'Sample Sheet'!$O$15=\"Bionano use only\"),\"\",'Sample Sheet'!$O$15)","v":""}]
[{"$f":"'Sample Sheet'!B26&\"\"","v":""},{"$f":"'Sample Sheet'!C26&\"\"","v":""},{"$f":"'Sample Sheet'!D26&\"\"","v":""},{"$f":"'Sample Sheet'!E26&\"\"","v":""},{"$f":"'Sample Sheet'!F26&\"\"","v":""},{"$f":"'Sample Sheet'!G26&\"\"","v":""},{"$f":"'Sample Sheet'!H26&\"\"","v":""},{"$f":"'Sample Sheet'!I26&\"\"","v":""},{"$f":"'Sample Sheet'!J26&\"\"","v":""},{"$f":"'Sample Sheet'!K26&\"\"","v":""},{"$f":"'Sample Sheet'!L26&\"\"","v":""},{"$f":"'Sample Sheet'!M26&\"\"","v":""},{"$f":"'Sample Sheet'!N26&\"\"","v":""},{"$f":"'Sample Sheet'!O26&\"\"","v":""},{"$f":"'Sample Sheet'!P26&\"\"","v":""},{"$f":"'Sample Sheet'!Q26&\"\"","v":""},{"$f":"'Sample Sheet'!R26&\"\"","v":""},{"$f":"IF(OR(COUNTBLANK(A7:Q7)=COLUMNS(A:Q),ISBLANK('Sample Sheet'!$I$13)),\"\",'Sample Sheet'!$I$13)","v":""},{"$f":"IF(OR(COUNTBLANK(A7:Q7)=COLUMNS(A:Q),'Sample Sheet'!$O$13=\"Bionano use only\"),\"\",'Sample Sheet'!$O$13)","v":""},{"$f":"IF(COUNTBLANK(A7:Q7)=COLUMNS(A:Q),\"\",'Sample Sheet'!$I$2)","v":""},{"$f":"IF(COUNTBLANK(A7:Q7)=COLUMNS(A:Q),\"\",'Sample Sheet'!$I$15)","v":""},{"$f":"IF(COUNTBLANK(A7:Q7)=COLUMNS(A:Q),\"\",IF('Sample Sheet'!$I$17='Data Validation'!$J$2,'Data Validation'!$J$4,IF('Sample Sheet'!$I$17='Data Validation'!$J$3,'Data Validation'!$J$5,\"\")))","v":""},{"$f":"IF(COUNTBLANK(A7:Q7)=COLUMNS(A:Q),\"\",IFERROR(REPLACE(LEFT('Sample Sheet'!$O$17,FIND(\";\",SUBSTITUTE('Sample Sheet'!$O$17,\"/\",\";\",7))-1),1,FIND(\" \",SUBSTITUTE(LEFT('Sample Sheet'!$O$17,FIND(\";\",SUBSTITUTE('Sample Sheet'!$O$17,\"/\",\";\",7))-1),\"/\",\" \",6)),\"\"),\"\"))","v":""},{"$f":"IF(OR(COUNTBLANK(A7:Q7)=COLUMNS(A:Q),'Sample Sheet'!$O$15=\"Bionano use only\"),\"\",'Sample Sheet'!$O$15)","v":""}]
[{"$f":"'Sample Sheet'!B27&\"\"","v":""},{"$f":"'Sample Sheet'!C27&\"\"","v":""},{"$f":"'Sample Sheet'!D27&\"\"","v":""},{"$f":"'Sample Sheet'!E27&\"\"","v":""},{"$f":"'Sample Sheet'!F27&\"\"","v":""},{"$f":"'Sample Sheet'!G27&\"\"","v":""},{"$f":"'Sample Sheet'!H27&\"\"","v":""},{"$f":"'Sample Sheet'!I27&\"\"","v":""},{"$f":"'Sample Sheet'!J27&\"\"","v":""},{"$f":"'Sample Sheet'!K27&\"\"","v":""},{"$f":"'Sample Sheet'!L27&\"\"","v":""},{"$f":"'Sample Sheet'!M27&\"\"","v":""},{"$f":"'Sample Sheet'!N27&\"\"","v":""},{"$f":"'Sample Sheet'!O27&\"\"","v":""},{"$f":"'Sample Sheet'!P27&\"\"","v":""},{"$f":"'Sample Sheet'!Q27&\"\"","v":""},{"$f":"'Sample Sheet'!R27&\"\"","v":""},{"$f":"IF(OR(COUNTBLANK(A8:Q8)=COLUMNS(A:Q),ISBLANK('Sample Sheet'!$I$13)),\"\",'Sample Sheet'!$I$13)","v":""},{"$f":"IF(OR(COUNTBLANK(A8:Q8)=COLUMNS(A:Q),'Sample Sheet'!$O$13=\"Bionano use only\"),\"\",'Sample Sheet'!$O$13)","v":""},{"$f":"IF(COUNTBLANK(A8:Q8)=COLUMNS(A:Q),\"\",'Sample Sheet'!$I$2)","v":""},{"$f":"IF(COUNTBLANK(A8:Q8)=COLUMNS(A:Q),\"\",'Sample Sheet'!$I$15)","v":""},{"$f":"IF(COUNTBLANK(A8:Q8)=COLUMNS(A:Q),\"\",IF('Sample Sheet'!$I$17='Data Validation'!$J$2,'Data Validation'!$J$4,IF('Sample Sheet'!$I$17='Data Validation'!$J$3,'Data Validation'!$J$5,\"\")))","v":""},{"$f":"IF(COUNTBLANK(A8:Q8)=COLUMNS(A:Q),\"\",IFERROR(REPLACE(LEFT('Sample Sheet'!$O$17,FIND(\";\",SUBSTITUTE('Sample Sheet'!$O$17,\"/\",\";\",7))-1),1,FIND(\" \",SUBSTITUTE(LEFT('Sample Sheet'!$O$17,FIND(\";\",SUBSTITUTE('Sample Sheet'!$O$17,\"/\",\";\",7))-1),\"/\",\" \",6)),\"\"),\"\"))","v":""},{"$f":"IF(OR(COUNTBLANK(A8:Q8)=COLUMNS(A:Q),'Sample Sheet'!$O$15=\"Bionano use only\"),\"\",'Sample Sheet'!$O$15)","v":""}]
[{"$f":"'Sample Sheet'!B28&\"\"","v":""},{"$f":"'Sample Sheet'!C28&\"\"","v":""},{"$f":"'Sample Sheet'!D28&\"\"","v":""},{"$f":"'Sample Sheet'!E28&\"\"","v":""},{"$f":"'Sample Sheet'!F28&\"\"","v":""},{"$f":"'Sample Sheet'!G28&\"\"","v":""},{"$f":"'Sample Sheet'!H28&\"\"","v":""},{"$f":"'Sample Sheet'!I28&\"\"","v":""},{"$f":"'Sample Sheet'!J28&\"\"","v":""},{"$f":"'Sample Sheet'!K28&\"\"","v":""},{"$f":"'Sample Sheet'!L28&\"\"","v":""},{"$f":"'Sample Sheet'!M28&\"\"","v":""},{"$f":"'Sample Sheet'!N28&\"\"","v":""},{"$f":"'Sample Sheet'!O28&\"\"","v":""},{"$f":"'Sample Sheet'!P28&\"\"","v":""},{"$f":"'Sample Sheet'!Q28&\"\"","v":""},{"$f":"'Sample Sheet'!R28&\"\"","v":""},{"$f":"IF(OR(COUNTBLANK(A9:Q9)=COLUMNS(A:Q),ISBLANK('Sample Sheet'!$I$13)),\"\",'Sample Sheet'!$I$13)","v":""},{"$f":"IF(OR(COUNTBLANK(A9:Q9)=COLUMNS(A:Q),'Sample Sheet'!$O$13=\"Bionano use only\"),\"\",'Sample Sheet'!$O$13)","v":""},{"$f":"IF(COUNTBLANK(A9:Q9)=COLUMNS(A:Q),\"\",'Sample Sheet'!$I$2)","v":""},{"$f":"IF(COUNTBLANK(A9:Q9)=COLUMNS(A:Q),\"\",'Sample Sheet'!$I$15)","v":""},{"$f":"IF(COUNTBLANK(A9:Q9)=COLUMNS(A:Q),\"\",IF('Sample Sheet'!$I$17='Data Validation'!$J$2,'Data Validation'!$J$4,IF('Sample Sheet'!$I$17='Data Validation'!$J$3,'Data Validation'!$J$5,\"\")))","v":""},{"$f":"IF(COUNTBLANK(A9:Q9)=COLUMNS(A:Q),\"\",IFERROR(REPLACE(LEFT('Sample Sheet'!$O$17,FIND(\";\",SUBSTITUTE('Sample Sheet'!$O$17,\"/\",\";\",7))-1),1,FIND(\" \",SUBSTITUTE(LEFT('Sample Sheet'!$O$17,FIND(\";\",SUBSTITUTE('Sample Sheet'!$O$17,\"/\",\";\",7))-1),\"/\",\" \",6)),\"\"),\"\"))","v":""},{"$f":"IF(OR(COUNTBLANK(A9:Q9)=COLUMNS(A:Q),'Sample Sheet'!$O$15=\"Bionano use only\"),\"\",'Sample Sheet'!$O$15)","v":""}]
[{"$f":"'Sample Sheet'!B29&\"\"","v":""},{"$f":"'Sample Sheet'!C29&\"\"","v":""},{"$f":"'Sample Sheet'!D29&\"\"","v":""},{"$f":"'Sample Sheet'!E29&\"\"","v":""},{"$f":"'Sample Sheet'!F29&\"\"","v":""},{"$f":"'Sample Sheet'!G29&\"\"","v":""},{"$f":"'Sample Sheet'!H29&\"\"","v":""},{"$f":"'Sample Sheet'!I29&\"\"","v":""},{"$f":"'Sample Sheet'!J29&\"\"","v":""},{"$f":"'Sample Sheet'!K29&\"\"","v":""},{"$f":"'Sample Sheet'!L29&\"\"","v":""},{"$f":"'Sample Sheet'!M29&\"\"","v":""},{"$f":"'Sample Sheet'!N29&\"\"","v":""},{"$f":"'Sample Sheet'!O29&\"\"","v":""},{"$f":"'Sample Sheet'!P29&\"\"","v":""},{"$f":"'Sample Sheet'!Q29&\"\"","v":""},{"$f":"'Sample Sheet'!R29&\"\"","v":""},{"$f":"IF(OR(COUNTBLANK(A10:Q10)=COLUMNS(A:Q),ISBLANK('Sample Sheet'!$I$13)),\"\",'Sample Sheet'!$I$13)","v":""},{"$f":"IF(OR(COUNTBLANK(A10:Q10)=COLUMNS(A:Q),'Sample Sheet'!$O$13=\"Bionano use only\"),\"\",'Sample Sheet'!$O$13)","v":""},{"$f":"IF(COUNTBLANK(A10:Q10)=COLUMNS(A:Q),\"\",'Sample Sheet'!$I$2)","v":""},{"$f":"IF(COUNTBLANK(A10:Q10)=COLUMNS(A:Q),\"\",'Sample Sheet'!$I$15)","v":""},{"$f":"IF(COUNTBLANK(A10:Q10)=COLUMNS(A:Q),\"\",IF('Sample Sheet'!$I$17='Data Validation'!$J$2,'Data Validation'!$J$4,IF('Sample Sheet'!$I$17='Data Validation'!$J$3,'Data Validation'!$J$5,\"\")))","v":""},{"$f":"IF(COUNTBLANK(A10:Q10)=COLUMNS(A:Q),\"\",IFERROR(REPLACE(LEFT('Sample Sheet'!$O$17,FIND(\";\",SUBSTITUTE('Sample Sheet'!$O$17,\"/\",\";\",7))-1),1,FIND(\" \",SUBSTITUTE(LEFT('Sample Sheet'!$O$17,FIND(\";\",SUBSTITUTE('Sample Sheet'!$O$17,\"/\",\";\",7))-1),\"/\",\" \",6)),\"\"),\"\"))","v":""},{"$f":"IF(OR(COUNTBLANK(A10:Q10)=COLUMNS(A:Q),'Sample Sheet'!$O$15=\"Bionano use only\"),\"\",'Sample Sheet'!$O$15)","v":""}]
{"$rows_left_out":88}
{"sheet":"Data Validation","index":5,"n_rows":47,"n_cols":14,"rows_kept":47,"cut":false,"hidden":true,"merged":[]}
["sample type","Organism","Reference Genome","Coverage Target","Application Desired","Variant Annotation","Sample Relationship","Sex","Sample/DNA Return","Data Use Consent","Biohazard Level",null,"Objective or Pathology","Major Application"]
["Frozen cells (cryopreserved)","Homo sapiens","hg19/grch37 (human)","100X (400 Gbp)","De novo Assembly","Single","Control","Male","Yes - DNA","Consent","Non-biohazardous",null,"ALL","Reproductive Disorders and Prenatal-constitutional"]
["Frozen cells (dry pellet)","Mus musculus","hg38/grch38 (human)","200X (800 Gbp)","Rare Variant Analysis","Dual","Case","Female","Yes - Sample","Do not consent","Biosafety level 1",null,"AML","Postnatal-constitutional"]
["Frozen blood (EDTA)","Saccharomyces cerevisiae","GRCm38/mm10 (mouse)","400X (1.5 Tbp)","FSHD","Trio","Edited","N/A","Yes - DNA and Sample","Yes","Biosafety level 2",null,"Animal","Heme"]
["Frozen blood (Heparin) with DNA stabilizer","Danio rario","No reference","Up to 1600X (5 Tbp)","Fragile X",null,"Unedited",null,"No","No",null,null,"ATRT","Solid Tumor"]
["Frozen blood (Heparin) without DNA stabilizer","Drosophila melanogaster","Other","Other","Hybrid Scaffolding",null,"Tumor",null,"Unknown",null,null,null,"Brain","Human Research"]
["Frozen bone marrow (EDTA)","Caenorhabditis elegans",null,null,"Other",null,"WT",null,null,null,null,null,"Breast","Cell QC/Manufacturing"]
["Frozen bone marrow (Heparin) with DNA stabilizer","Xenopus tropicalis",null,null,null,null,"Proband",null,null,null,null,null,"Cancer","Non-Human"]
["Frozen bone marrow (Heparin) without DNA stabilizer","Other",null,null,null,null,"Father",null,null,null,null,null,"Cell QC/Manufacturing","Technology Development"]
["Frozen soft tissue",null,null,null,null,null,"Mother",null,null,null,null,null,"CLL","Other"]
{"$rows_left_out":37}